Reaction Details
TargetInterstitial collagenase
LigandBDBM50127864
Substrate/Competitorn/a
Meas. Tech.ChEBML_105956
IC50 6±n/a nM
Citation Augé, FHornebeck, WDecarme, MLaronze, JY Improved gelatinase a selectivity by novel zinc binding groups containing galardin derivatives. Bioorg Med Chem Lett13:1783-6 (2003) Interstitial collagenase
Name:Interstitial collagenase
Type:Enzyme
Mol. Mass.:54010.26
Organism:Homo sapiens (Human)
Description: P03956
Residue:469
BDBM50127864
NameBDBM50127864
Synonyms:(R)-3-[2-(1H-Indol-3-yl)-1-methylcarbamoyl-ethylcarbamoyl]-5-methyl-hexanoic acid | CHEMBL50209
TypeSmall organic molecule
Emp. Form.C20H27N3O4
Mol. Mass.373.4461
SMILESCNC(=O)C(Cc1c[nH]c2ccccc12)NC(=O)[C@H](CC(C)C)CC(O)=O