Reaction Details
TargetIntegrin alpha-V/beta-3
LigandBDBM50127944
Substrate/Competitorn/a
Meas. Tech.ChEMBL_217799 (CHEMBL824059)
IC50 0.200000±n/a nM
Citation Breslin, MJDuggan, MEHalczenko, WFernandez-Metzler, CHunt, CALeu, CTMerkle, KMNaylor-Olsen, AMPrueksaritanont, TStump, GWallace, ARodan, SBHutchinson, JH Non-peptide alphavbeta3 antagonists. Part 6: design and synthesis of alphavbeta3 antagonists containing a pyridone or pyrazinone central scaffold. Bioorg Med Chem Lett13:1809-12 (2003) Integrin alpha-V/beta-3
Name:Integrin alpha-V/beta-3
Type:Enzyme
Mol. Mass.:n/a
Description:n/a
Components:This complex has 2 components.
Component 1
Name:Integrin alpha-V
Synonyms:ITAV_HUMAN Integrin alpha-V/alpha-5 VNRA Vitronectin receptor | Vitronectin receptor subunit alpha
Type:PROTEIN
Mol. Mass.:116024.92
Organism:Homo sapiens (Human)
Description:ChEMBL_582336
Residue:1048
Component 2
Name:Integrin beta-3
Synonyms:CD_antigen=CD61 GPIIIa ITGB3 Platelet membrane glycoprotein IIIa
Type:Protein
Mol. Mass.:87038.91
Organism:Homo sapiens (Human)
Description:P05106
Residue:788
BDBM50127944
NameBDBM50127944
Synonyms:(S)-3-Benzo[1,3]dioxol-5-yl-3-(2-{6-cyclopropyl-2-oxo-3-[(5,6,7,8-tetrahydro-[1,8]naphthyridin-2-ylmethyl)-amino]-2H-pyrazin-1-yl}-acetylamino)-propionic acid | CHEMBL51391
TypeSmall organic molecule
Emp. Form.C28H30N6O6
Mol. Mass.546.5744
SMILESOC(=O)C[C@H](NC(=O)Cn1c(cnc(NCc2ccc3CCCNc3n2)c1=O)C1CC1)c1ccc2OCOc2c1