Reaction Details
TargetLanosterol synthase
LigandBDBM50128060
Substrate/Competitorn/a
Meas. Tech.ChEMBL_148897 (CHEMBL754981)
IC50 3±n/a nM
Citation Lenhart, AReinert, DJAebi, JDDehmlow, HMorand, OHSchulz, GE Binding structures and potencies of oxidosqualene cyclase inhibitors with the homologous squalene-hopene cyclase. J Med Chem46:2083-92 (2003) 
 
Lanosterol synthase
Name:Lanosterol synthase
Type:PROTEIN
Mol. Mass.:83309.32
Organism:Homo sapiens (Human)
Description:ChEMBL_11231
Residue:732
BDBM50128060
NameBDBM50128060
Synonyms:CHEMBL63524 {4-[4-(Allyl-methyl-amino)-but-2-enyloxy]-phenyl}-(4-bromo-phenyl)-methanone
TypeSmall organic molecule
Emp. Form.C21H22BrNO2
Mol. Mass.400.309
SMILESCN(CC=C)C\C=C\COc1ccc(cc1)C(=O)c1ccc(Br)cc1