Reaction Details
TargetLanosterol synthase
LigandBDBM50128055
Substrate/Competitorn/a
Meas. Tech.ChEMBL_148897 (CHEMBL754981)
IC50 4.1±n/a nM
Citation Lenhart, AReinert, DJAebi, JDDehmlow, HMorand, OHSchulz, GE Binding structures and potencies of oxidosqualene cyclase inhibitors with the homologous squalene-hopene cyclase. J Med Chem46:2083-92 (2003) 
 
Lanosterol synthase
Name:Lanosterol synthase
Type:PROTEIN
Mol. Mass.:83309.32
Organism:Homo sapiens (Human)
Description:ChEMBL_11231
Residue:732
BDBM50128055
NameBDBM50128055
Synonyms:Allyl-{6-[4-(4-bromo-phenyl)-1H-benzo[d][1,2]oxazin-7-yloxy]-hexyl}-methyl-amine CHEMBL66638 | N-allyl-6-(4-(4-bromophenyl)-1H-benzo[d][1,2]oxazin-7-yloxy)-N-methylhexan-1-aminium
TypeSmall organic molecule
Emp. Form.C24H29BrN2O2
Mol. Mass.457.403
SMILESCN(CCCCCCOc1ccc2C(=NOCc2c1)c1ccc(Br)cc1)CC=C