Reaction Details
TargetLanosterol synthase
LigandBDBM50128065
Substrate/Competitorn/a
Meas. Tech.ChEMBL_148897 (CHEMBL754981)
IC50 6.5±n/a nM
Citation Lenhart, AReinert, DJAebi, JDDehmlow, HMorand, OHSchulz, GE Binding structures and potencies of oxidosqualene cyclase inhibitors with the homologous squalene-hopene cyclase. J Med Chem46:2083-92 (2003) 
 
Lanosterol synthase
Name:Lanosterol synthase
Type:PROTEIN
Mol. Mass.:83309.32
Organism:Homo sapiens (Human)
Description:ChEMBL_11231
Residue:732
BDBM50128065
NameBDBM50128065
Synonyms:CHEMBL304858 N-allyl-6-(4-(4-bromobenzoyl)-3-fluorophenoxy)-N-methylhexan-1-aminium {4-[6-(Allyl-methyl-amino)-hexyloxy]-2-fluoro-phenyl}-(4-bromo-phenyl)-methanone
TypeSmall organic molecule
Emp. Form.C23H27BrFNO2
Mol. Mass.448.368
SMILESCN(CCCCCCOc1ccc(C(=O)c2ccc(Br)cc2)c(F)c1)CC=C