Reaction Details
TargetGamma-aminobutyric acid receptor subunit alpha-1/beta-3/gamma-2
LigandBDBM50128250
Substrate/Competitorn/a
Meas. Tech.ChEMBL_70106 (CHEMBL681641)
Ki 24±n/a nM
Citation Chambers, MSAtack, JRBroughton, HBCollinson, NCook, SDawson, GRHobbs, SCMarshall, GMaubach, KAPillai, GVReeve, AJMacLeod, AM Identification of a novel, selective GABA(A) alpha5 receptor inverse agonist which enhances cognition. J Med Chem46:2227-40 (2003) 
 
Gamma-aminobutyric acid receptor subunit alpha-1/beta-3/gamma-2
Name:Gamma-aminobutyric acid receptor subunit alpha-1/beta-3/gamma-2
Type:Protein
Mol. Mass.:n/a
Description:n/a
Components:This complex has 3 components.
Component 1
Name:Gamma-aminobutyric acid receptor subunit alpha-1
Synonyms:Benzodiazepine central GABA A Benzodiazepine liver GABA(A) receptor subunit alpha-1 GABA-A receptor GBRA1_HUMAN TBPS | agonist GABA site
Type:Protein
Mol. Mass.:51817.35
Organism:Homo sapiens (Human)
Description:P14867
Residue:456
Component 2
Name:Gamma-aminobutyric acid receptor subunit beta-3
Synonyms:GABA A receptor alpha-4/beta-3/gamma-2 GABA-A receptor GBRB3_HUMAN | agonist GABA site
Type:PROTEIN
Mol. Mass.:54130.51
Organism:Homo sapiens (Human)
Description:ChEMBL_448071
Residue:473
Component 3
Name:Gamma-aminobutyric acid receptor subunit gamma-2
Synonyms:GABA(A) receptor subunit gamma-2 GBRG2_HUMAN
Type:PROTEIN
Mol. Mass.:54172.74
Organism:Homo sapiens (Human)
Description:EBI_217
Residue:467
BDBM50128250
NameBDBM50128250
Synonyms:6,6-Dimethyl-1-thiazol-2-yl-3-(thiazol-2-ylsulfanyl)-6,7-dihydro-5H-benzo[c]thiophen-4-one | CHEMBL73486
TypeSmall organic molecule
Emp. Form.C16H14N2OS4
Mol. Mass.378.555
SMILESCC1(C)Cc2c(sc(Sc3nccs3)c2C(=O)C1)-c1nccs1