Reaction Details
TargetProto-oncogene tyrosine-protein kinase Src
LigandBDBM50128287
Substrate/Competitorn/a
Meas. Tech.ChEBML_202623
IC50>100000±n/a nM
Citation Faul, MMGillig, JRJirousek, MRBallas, LMSchotten, TKahl, AMohr, M Acyclic N-(azacycloalkyl)bisindolylmaleimides: isozyme selective inhibitors of PKCbeta. Bioorg Med Chem Lett13:1857-9 (2003) Proto-oncogene tyrosine-protein kinase Src
Name:Proto-oncogene tyrosine-protein kinase Src
Type:Protein
Mol. Mass.:59838.60
Organism:Homo sapiens (Human)
Description:P12931
Residue:536
BDBM50128287
NameBDBM50128287
Synonyms:3-(1-Methyl-1H-indol-3-yl)-4-[1-(1-methyl-piperidin-4-yl)-1H-indol-3-yl]-pyrrole-2,5-dione | CHEMBL53596
TypeSmall organic molecule
Emp. Form.C27H26N4O2
Mol. Mass.438.5209
SMILESCN1CCC(CC1)n1cc(C2=C(C(=O)NC2=O)c2cn(C)c3ccccc23)c2ccccc12