Reaction Details
TargetProtein kinase C beta type
LigandBDBM50128283
Substrate/Competitorn/a
Meas. Tech.ChEBML_160462
IC50 24±n/a nM
Citation Faul, MMGillig, JRJirousek, MRBallas, LMSchotten, TKahl, AMohr, M Acyclic N-(azacycloalkyl)bisindolylmaleimides: isozyme selective inhibitors of PKCbeta. Bioorg Med Chem Lett13:1857-9 (2003) Protein kinase C beta type
Name:Protein kinase C beta type
Type:Enzyme
Mol. Mass.:76873.67
Organism:Homo sapiens (Human)
Description:The recombinant human PKC enzymes were produced using a baculovirus expression system in SF9 cells
Residue:671
BDBM50128283
NameBDBM50128283
Synonyms:3-[1-(1-Benzyl-pyrrolidin-3-yl)-1H-indol-3-yl]-4-(1-methyl-1H-indol-3-yl)-pyrrole-2,5-dione | CHEMBL291975
TypeSmall organic molecule
Emp. Form.C32H28N4O2
Mol. Mass.500.5903
SMILESCn1cc(C2=C(C(=O)NC2=O)c2cn(C3CCN(Cc4ccccc4)C3)c3ccccc23)c2ccccc12