Reaction Details
TargetProtein kinase C beta type
LigandBDBM50128286
Substrate/Competitorn/a
Meas. Tech.ChEMBL_160462 (CHEMBL761758)
IC50 19±n/a nM
Citation Faul, MMGillig, JRJirousek, MRBallas, LMSchotten, TKahl, AMohr, M Acyclic N-(azacycloalkyl)bisindolylmaleimides: isozyme selective inhibitors of PKCbeta. Bioorg Med Chem Lett13:1857-9 (2003) Protein kinase C beta type
Name:Protein kinase C beta type
Type:Enzyme
Mol. Mass.:76873.67
Organism:Homo sapiens (Human)
Description:The recombinant human PKC enzymes were produced using a baculovirus expression system in SF9 cells
Residue:671
BDBM50128286
NameBDBM50128286
Synonyms:3-[1-(1-Isopropyl-piperidin-4-yl)-1H-indol-3-yl]-4-(1-methyl-1H-indol-3-yl)-pyrrole-2,5-dione | CHEMBL301860
TypeSmall organic molecule
Emp. Form.C29H30N4O2
Mol. Mass.466.5741
SMILESCC(C)N1CCC(CC1)n1cc(C2=C(C(=O)NC2=O)c2cn(C)c3ccccc23)c2ccccc12