Reaction Details
TargetProtein kinase C beta type
LigandBDBM50128280
Substrate/Competitorn/a
Meas. Tech.ChEMBL_160611 (CHEMBL764582)
IC50 5±n/a nM
Citation Faul, MMGillig, JRJirousek, MRBallas, LMSchotten, TKahl, AMohr, M Acyclic N-(azacycloalkyl)bisindolylmaleimides: isozyme selective inhibitors of PKCbeta. Bioorg Med Chem Lett13:1857-9 (2003) Protein kinase C beta type
Name:Protein kinase C beta type
Type:Enzyme
Mol. Mass.:76873.67
Organism:Homo sapiens (Human)
Description:The recombinant human PKC enzymes were produced using a baculovirus expression system in SF9 cells
Residue:671
BDBM50128280
NameBDBM50128280
Synonyms:3-[1-(1-Ethyl-piperidin-4-yl)-1H-indol-3-yl]-4-(1-methyl-1H-indol-3-yl)-pyrrole-2,5-dione | CHEMBL54382
TypeSmall organic molecule
Emp. Form.C28H28N4O2
Mol. Mass.452.5475
SMILESCCN1CCC(CC1)n1cc(C2=C(C(=O)NC2=O)c2cn(C)c3ccccc23)c2ccccc12