Reaction Details
TargetKappa-type opioid receptor
LigandBDBM50001023
Substrate/Competitorn/a
Meas. Tech.ChEBML_146513
Ki 0.180000±n/a nM
Citation Wentland, MPSun, XYe, YLou, RBidlack, JM Redefining the structure-activity relationships of 2,6-methano-3-benzazocines. Part 2: 8-formamidocyclazocine analogues. Bioorg Med Chem Lett13:1911-4 (2003) Kappa-type opioid receptor
Name:Kappa-type opioid receptor
Type:G Protein-Coupled Receptor (GPCR)
Mol. Mass.:42744.99
Organism:Cavia porcellus (domestic guinea pig)
Description:P41144
Residue:380
BDBM50001023
NameBDBM50001023
Synonyms:(2R,6R,11R)-3-Cyclopropylmethyl-6,11-dimethyl-1,2,3,4,5,6-hexahydro-2,6-methano-benzo[d]azocin-8-ol CHEMBL56585 US10231963, Table B.9 US11534436, Compound Table B.9 | US9656961, Example 00126
TypeSmall organic molecule
Emp. Form.C18H25NO
Mol. Mass.271.3972
SMILESC[C@H]1[C@H]2Cc3ccc(O)cc3[C@]1(C)CCN2CC1CC1