Reaction Details
TargetHistamine H3 receptor
LigandBDBM50128887
Substrate/Competitorn/a
Meas. Tech.ChEBML_85847
Ki 1±n/a nM
Citation Aslanian, RMutahi, MShih, NYPiwinski, JJWest, RWilliams, SMShe, SWu, RLHey, JA Identification of a dual histamine H1/H3 receptor ligand based on the H1 antagonist chlorpheniramine. Bioorg Med Chem Lett13:1959-61 (2003) Histamine H3 receptor
Name:Histamine H3 receptor
Type:Enzyme Catalytic Domain
Mol. Mass.:48753.61
Organism:GUINEA PIG
Description:HISTAMINE H3 HRH3 GUINEA PIG::Q9JI35
Residue:445
BDBM50128887
NameBDBM50128887
Synonyms:3-(4-Chloro-phenyl)-N-[4-(1H-imidazol-4-yl)-butyl]-3-pyridin-2-yl-propionamide | CHEMBL444827
TypeSmall organic molecule
Emp. Form.C21H23ClN4O
Mol. Mass.382.887
SMILESClc1ccc(cc1)C(CC(=O)NCCCCc1cnc[nH]1)c1ccccn1