Reaction Details
TargetHistamine H3 receptor
LigandBDBM50128890
Substrate/Competitorn/a
Meas. Tech.ChEBML_85847
Ki 4±n/a nM
Citation Aslanian, RMutahi, MShih, NYPiwinski, JJWest, RWilliams, SMShe, SWu, RLHey, JA Identification of a dual histamine H1/H3 receptor ligand based on the H1 antagonist chlorpheniramine. Bioorg Med Chem Lett13:1959-61 (2003) Histamine H3 receptor
Name:Histamine H3 receptor
Type:Enzyme Catalytic Domain
Mol. Mass.:48753.61
Organism:GUINEA PIG
Description:HISTAMINE H3 HRH3 GUINEA PIG::Q9JI35
Residue:445
BDBM50128890
NameBDBM50128890
Synonyms:(3,3-Di-pyridin-2-yl-propyl)-[4-(1H-imidazol-4-yl)-butyl]-amine | CHEMBL59123
TypeSmall organic molecule
Emp. Form.C20H25N5
Mol. Mass.335.446
SMILESC(CCc1cnc[nH]1)CNCCC(c1ccccn1)c1ccccn1