Reaction Details
TargetHistamine H3 receptor
LigandBDBM50128886
Substrate/Competitorn/a
Meas. Tech.ChEBML_85847
Ki 1±n/a nM
Citation Aslanian, RMutahi, MShih, NYPiwinski, JJWest, RWilliams, SMShe, SWu, RLHey, JA Identification of a dual histamine H1/H3 receptor ligand based on the H1 antagonist chlorpheniramine. Bioorg Med Chem Lett13:1959-61 (2003) Histamine H3 receptor
Name:Histamine H3 receptor
Type:Enzyme Catalytic Domain
Mol. Mass.:48753.61
Organism:GUINEA PIG
Description:HISTAMINE H3 HRH3 GUINEA PIG::Q9JI35
Residue:445
BDBM50128886
NameBDBM50128886
Synonyms:CHEMBL418653 | N-[4-(1H-Imidazol-4-yl)-butyl]-3,3-di-pyridin-2-yl-propionamide
TypeSmall organic molecule
Emp. Form.C20H23N5O
Mol. Mass.349.4295
SMILESO=C(CC(c1ccccn1)c1ccccn1)NCCCCc1cnc[nH]1