Reaction Details
TargetHistamine H3 receptor
LigandBDBM50128889
Substrate/Competitorn/a
Meas. Tech.ChEBML_85847
Ki 1±n/a nM
Citation Aslanian, RMutahi, MShih, NYPiwinski, JJWest, RWilliams, SMShe, SWu, RLHey, JA Identification of a dual histamine H1/H3 receptor ligand based on the H1 antagonist chlorpheniramine. Bioorg Med Chem Lett13:1959-61 (2003) Histamine H3 receptor
Name:Histamine H3 receptor
Type:Enzyme Catalytic Domain
Mol. Mass.:48753.61
Organism:GUINEA PIG
Description:HISTAMINE H3 HRH3 GUINEA PIG::Q9JI35
Residue:445
BDBM50128889
NameBDBM50128889
Synonyms:3-(4-Chloro-phenyl)-N-[2-(1H-imidazol-4-yl)-ethyl]-N-methyl-3-pyridin-2-yl-propionamide | CHEMBL292909
TypeSmall organic molecule
Emp. Form.C20H21ClN4O
Mol. Mass.368.86
SMILESCN(CCc1cnc[nH]1)C(=O)CC(c1ccc(Cl)cc1)c1ccccn1