Reaction Details
TargetHistamine H1 receptor
LigandBDBM35938
Substrate/Competitorn/a
Meas. Tech.ChEBML_84710
Ki 2±n/a nM
Citation Aslanian, RMutahi, MShih, NYPiwinski, JJWest, RWilliams, SMShe, SWu, RLHey, JA Identification of a dual histamine H1/H3 receptor ligand based on the H1 antagonist chlorpheniramine. Bioorg Med Chem Lett13:1959-61 (2003) Histamine H1 receptor
Name:Histamine H1 receptor
Type:Enzyme Catalytic Domain
Mol. Mass.:55716.35
Organism:RAT
Description:HISTAMINE H1 HRH1 RAT::P31390
Residue:486
BDBM35938
NameBDBM35938
Synonyms:1-(p-chlorophenyl)-1-(2-pyridyl)-3-N,N-dimethylpropylamine 3-(p-chlorophenyl)-3-(2-pyridyl)-N,N-dimethylpropylamine CHEMBL505 CHLORPHENIRAMINE MALEATE Polaramine [3H]Chlorphenamine chlorophenylpyridamine clorfeniramina gamma-(4-chlorophenyl)-N,N-dimethyl-2-pyridinepropanamine | gamma-(4-chlorophenyl)-gamma-(2-pyridyl)propyldimethylamine
Typeradiolabeled ligand
Emp. Form.C16H19ClN2
Mol. Mass.274.788
SMILESCN(C)CCC(c1ccc(Cl)cc1)c1ccccn1