Reaction Details
TargetNeuropeptide Y receptor type 5
LigandBDBM50128945
Substrate/Competitorn/a
Meas. Tech.ChEBML_144128
Ki 2165±n/a nM
Citation Hammond, MElliott, RLGillaspy, MLHager, DCHank, RFLaFlamme, JAOliver, RMDaSilva-Jardine, PAStevenson, RWMack, CMCassella, JV Structure-activity relationships in a series of NPY Y5 antagonists: 3-amido-9-ethylcarbazoles, core-modified analogues and amide isosteres. Bioorg Med Chem Lett13:1989-92 (2003) Neuropeptide Y receptor type 5
Name:Neuropeptide Y receptor type 5
Type:Enzyme
Mol. Mass.:50746.64
Organism:Homo sapiens (Human)
Description:Q15761
Residue:445
BDBM50128945
NameBDBM50128945
Synonyms:2-Dimethylamino-N-(5-ethyl-6-oxo-5,6-dihydro-phenanthridin-8-yl)-acetamide | CHEMBL60667
TypeSmall organic molecule
Emp. Form.C19H21N3O2
Mol. Mass.323.3889
SMILESCCn1c2ccccc2c2ccc(NC(=O)CN(C)C)cc2c1=O