Reaction Details
TargetBone morphogenetic protein 1
LigandBDBM50129204
Substrate/Competitorn/a
Meas. Tech.ChEBML_158890
Ki 7±n/a nM
Citation Delaet, NGRobinson, LAWilson, DMSullivan, RWBradley, EKDankwardt, SMMartin, RLVan Wart, HEWalker, KA Novel inhibitors of procollagen C-terminal proteinase. Part 1: diamino Acid hydroxamates. Bioorg Med Chem Lett13:2101-4 (2003) Bone morphogenetic protein 1
Name:Bone morphogenetic protein 1
Type:PROTEIN
Mol. Mass.:111254.03
Organism:Homo sapiens (Human)
Description:ChEMBL_518962
Residue:986
BDBM50129204
NameBDBM50129204
Synonyms:CHEMBL65208 | N-{2-[Benzo[1,3]dioxol-5-ylmethyl-((R)-4-methoxy-benzenesulfonyl)-amino]-2-hydroxycarbamoyl-ethyl}-terephthalamic acid methyl ester
TypeSmall organic molecule
Emp. Form.C27H27N3O10S
Mol. Mass.585.582
SMILESCOC(=O)c1ccc(cc1)C(=O)NC[C@@H](N(Cc1ccc2OCOc2c1)S(=O)(=O)c1ccc(OC)cc1)C(=O)NO