Reaction Details
TargetBone morphogenetic protein 1
LigandBDBM50129220
Substrate/Competitorn/a
Meas. Tech.ChEBML_158890
Ki 86±n/a nM
Citation Delaet, NGRobinson, LAWilson, DMSullivan, RWBradley, EKDankwardt, SMMartin, RLVan Wart, HEWalker, KA Novel inhibitors of procollagen C-terminal proteinase. Part 1: diamino Acid hydroxamates. Bioorg Med Chem Lett13:2101-4 (2003) Bone morphogenetic protein 1
Name:Bone morphogenetic protein 1
Type:PROTEIN
Mol. Mass.:111254.03
Organism:Homo sapiens (Human)
Description:ChEMBL_518962
Residue:986
BDBM50129220
NameBDBM50129220
Synonyms:5-Methyl-isoxazole-4-carboxylic acid {3-[benzo[1,3]dioxol-5-ylmethyl-((R)-4-methoxy-benzenesulfonyl)-amino]-3-hydroxycarbamoyl-propyl}-amide | CHEMBL302636
TypeSmall organic molecule
Emp. Form.C24H26N4O9S
Mol. Mass.546.55
SMILESCOc1ccc(cc1)S(=O)(=O)N(Cc1ccc2OCOc2c1)[C@H](CCNC(=O)c1cnoc1C)C(=O)NO