Reaction Details
TargetD(3) dopamine receptor
LigandBDBM50129425
Substrate/Competitorn/a
Meas. Tech.ChEBML_223734
Ki 2.6±n/a nM
Citation Newman, AHCao, JBennett, CJRobarge, MJFreeman, RALuedtke, RR N-(4-[4-(2,3-dichlorophenyl)piperazin-1-yl]butyl, butenyl and butynyl)arylcarboxamides as novel dopamine D(3) receptor antagonists. Bioorg Med Chem Lett13:2179-83 (2003) D(3) dopamine receptor
Name:D(3) dopamine receptor
Type:Protein
Mol. Mass.:49540.58
Organism:Rattus norvegicus (Rat)
Description:P19020
Residue:446
BDBM50129425
NameBDBM50129425
Synonyms:5-Fluoro-1H-indole-2-carboxylic acid {4-[4-(2,3-dichloro-phenyl)-piperazin-1-yl]-butyl}-amide N-(4-(4-(2,3-dichlorophenyl)piperazin-1-yl)butyl)-5-fluoro-1H-indole-2-carboxamide
TypeSmall organic molecule
Emp. Form.C23H25Cl2FN4O
Mol. Mass.463.375
SMILESFc1ccc2[nH]c(cc2c1)C(=O)NCCCCN1CCN(CC1)c1cccc(Cl)c1Cl