Reaction Details
TargetD(2) dopamine receptor
LigandBDBM50071959
Substrate/Competitorn/a
Meas. Tech.ChEBML_62393
Ki 911±n/a nM
Citation Newman, AHCao, JBennett, CJRobarge, MJFreeman, RALuedtke, RR N-(4-[4-(2,3-dichlorophenyl)piperazin-1-yl]butyl, butenyl and butynyl)arylcarboxamides as novel dopamine D(3) receptor antagonists. Bioorg Med Chem Lett13:2179-83 (2003) D(2) dopamine receptor
Name:D(2) dopamine receptor
Type:G Protein-Coupled Receptor (GPCR)
Mol. Mass.:50931.60
Organism:Rattus norvegicus (rat)
Description:P61169
Residue:444
BDBM50071959
NameBDBM50071959
Synonyms:9H-Fluorene-2-carboxylic acid {4-[4-(2,3-dichloro-phenyl)-piperazin-1-yl]-butyl}-amide N-(4-(4-(2,3-dichlorophenyl)piperazin-1-yl)butyl)-9H-fluorene-2-carboxamide
TypeSmall organic molecule
Emp. Form.C28H29Cl2N3O
Mol. Mass.494.455
SMILESClc1cccc(N2CCN(CCCCNC(=O)c3ccc-4c(Cc5ccccc-45)c3)CC2)c1Cl