Reaction Details
TargetM-phase inducer phosphatase 2
LigandBDBM50129580
Substrate/Competitorn/a
Meas. Tech.ChEMBL_49035 (CHEMBL875900)
Ki 430.0±n/a nM
Citation Sohn, JKiburz, BLi, ZDeng, LSafi, APirrung, MCRudolph, J Inhibition of Cdc25 phosphatases by indolyldihydroxyquinones. J Med Chem46:2580-8 (2003) 
 
M-phase inducer phosphatase 2
Name:M-phase inducer phosphatase 2
Type:Protein
Mol. Mass.:64985.27
Organism:Homo sapiens (Human)
Description:n/a
Residue:580
BDBM50129580
NameBDBM50129580
Synonyms:3-[4,6-Dichloro-7-(3-methyl-but-2-enyl)-1H-indol-3-yl]-2,5-dihydroxy-[1,4]benzoquinone | CHEMBL86333
TypeSmall organic molecule
Emp. Form.C19H15Cl2NO4
Mol. Mass.392.233
SMILESCC(C)=CCc1c(Cl)cc(Cl)c2c(c[nH]c12)C1C(=O)C(=O)CC(=O)C1=O