Reaction Details
TargetHistone deacetylase 4
LigandBDBM50446481
Substrate/Competitorn/a
Meas. Tech.ChEMBL_2090262 (CHEMBL4771525)
Ki 126±n/a nM
Citation Ho, TCSChan, AHYGanesan, A Thirty Years of HDAC Inhibitors: 2020 Insight and Hindsight. J Med Chem63:12460-12484 (2020) 
 
Histone deacetylase 4
Name:Histone deacetylase 4
Type:Enzyme
Mol. Mass.:119049.39
Organism:Homo sapiens (Human)
Description:P56524
Residue:1084
BDBM50446481
NameBDBM50446481
Synonyms:CHEMBL3110004 US10722597, Compound TMP-269
TypeSmall organic molecule
Emp. Form.C25H21F3N4O3S
Mol. Mass.514.519
SMILESFC(F)(F)c1nc(no1)-c1cccc(c1)C(=O)NCC1(CCOCC1)c1nc(cs1)-c1ccccc1