Reaction Details
TargetNeuropeptide FF receptor 2
LigandBDBM50565184
Substrate/Competitorn/a
Meas. Tech.ChEMBL_2091000 (CHEMBL4772263)
Ki 282±n/a nM
Citation Nguyen, TMarusich, JLi, JXZhang, Y Neuropeptide FF and Its Receptors: Therapeutic Applications and Ligand Development. J Med Chem63:12387-12402 (2020) 
 
Neuropeptide FF receptor 2
Name:Neuropeptide FF receptor 2
Type:Enzyme Catalytic Domain
Mol. Mass.:47725.66
Organism:RAT
Description:NPFF2 0 RAT::Q9EQD2
Residue:417
BDBM50565184
NameBDBM50565184
Synonyms:CHEMBL4799458
TypeSmall organic molecule
Emp. Form.C11H11ClN4
Mol. Mass.234.685
SMILESCc1cc(NC(N)=N)nc2ccc(Cl)cc12