Reaction Details
TargetNeuropeptide FF receptor 2
LigandBDBM50565185
Substrate/Competitorn/a
Meas. Tech.ChEMBL_2091000 (CHEMBL4772263)
Ki 185±n/a nM
Citation Nguyen, TMarusich, JLi, JXZhang, Y Neuropeptide FF and Its Receptors: Therapeutic Applications and Ligand Development. J Med Chem63:12387-12402 (2020) 
 
Neuropeptide FF receptor 2
Name:Neuropeptide FF receptor 2
Type:Enzyme Catalytic Domain
Mol. Mass.:47725.66
Organism:RAT
Description:NPFF2 0 RAT::Q9EQD2
Residue:417
BDBM50565185
NameBDBM50565185
Synonyms:CHEMBL4777535
TypeSmall organic molecule
Emp. Form.C11H12N4
Mol. Mass.200.2398
SMILESCc1cc(NC(N)=N)nc2ccccc12