Reaction Details
TargetAmyloid-beta precursor protein
LigandBDBM50129787
Substrate/Competitorn/a
Meas. Tech.ChEMBL_35793 (CHEMBL649400)
Ki 8.6±n/a nM
Citation Mathis, CAWang, YHolt, DPHuang, GFDebnath, MLKlunk, WE Synthesis and evaluation of 11C-labeled 6-substituted 2-arylbenzothiazoles as amyloid imaging agents. J Med Chem46:2740-54 (2003) 
 
Amyloid-beta precursor protein
Name:Amyloid-beta precursor protein
Type:Single-pass type I membrane protein
Mol. Mass.:86890.41
Organism:Homo sapiens (Human)
Description:P05067
Residue:770
BDBM50129787
NameBDBM50129787
Synonyms:2-(4-Methylamino-phenyl)-benzothiazole-6-carbonitrile | CHEMBL92802
TypeSmall organic molecule
Emp. Form.C15H11N3S
Mol. Mass.265.333
SMILESCNc1ccc(cc1)-c1nc2ccc(cc2s1)C#N