Reaction Details
TargetAmyloid-beta precursor protein
LigandBDBM50129791
Substrate/Competitorn/a
Meas. Tech.ChEMBL_35793 (CHEMBL649400)
Ki 4±n/a nM
Citation Mathis, CAWang, YHolt, DPHuang, GFDebnath, MLKlunk, WE Synthesis and evaluation of 11C-labeled 6-substituted 2-arylbenzothiazoles as amyloid imaging agents. J Med Chem46:2740-54 (2003) 
 
Amyloid-beta precursor protein
Name:Amyloid-beta precursor protein
Type:Single-pass type I membrane protein
Mol. Mass.:86890.41
Organism:Homo sapiens (Human)
Description:P05067
Residue:770
BDBM50129791
NameBDBM50129791
Synonyms:(4-Benzothiazol-2-yl-phenyl)-dimethyl-amine CHEMBL92816
TypeSmall organic molecule
Emp. Form.C15H14N2S
Mol. Mass.254.35
SMILESCN(C)c1ccc(cc1)-c1nc2ccccc2s1