Reaction Details
TargetAmyloid-beta precursor protein
LigandBDBM50100133
Substrate/Competitorn/a
Meas. Tech.ChEMBL_35793 (CHEMBL649400)
Ki 2.9±n/a nM
Citation Mathis, CAWang, YHolt, DPHuang, GFDebnath, MLKlunk, WE Synthesis and evaluation of 11C-labeled 6-substituted 2-arylbenzothiazoles as amyloid imaging agents. J Med Chem46:2740-54 (2003) 
 
Amyloid-beta precursor protein
Name:Amyloid-beta precursor protein
Type:Single-pass type I membrane protein
Mol. Mass.:86890.41
Organism:Homo sapiens (Human)
Description:P05067
Residue:770
BDBM50100133
NameBDBM50100133
Synonyms:CHEMBL55401 | [4-(6-Bromo-benzothiazol-2-yl)-phenyl]-dimethyl-amine
TypeSmall organic molecule
Emp. Form.C15H13BrN2S
Mol. Mass.333.246
SMILESCN(C)c1ccc(cc1)-c1nc2ccc(Br)cc2s1