Reaction Details
Target5-hydroxytryptamine receptor 2C
LigandBDBM50129952
Substrate/Competitorn/a
Meas. Tech.ChEBML_2790
Ki 2555±n/a nM
Citation Hanrahan, JRChebib, MDavucheron, NLHall, BJJohnston, GA Semisynthetic preparation of amentoflavone: A negative modulator at GABA(A) receptors. Bioorg Med Chem Lett13:2281-4 (2003) 5-hydroxytryptamine receptor 2C
Name:5-hydroxytryptamine receptor 2C
Type:G Protein-Coupled Receptor (GPCR)
Mol. Mass.:51836.79
Organism:Homo sapiens (Human)
Description:P28335
Residue:458
BDBM50129952
NameBDBM50129952
Synonyms:2-(3-(5,7-dihydroxy-2-(4-hydroxyphenyl)-4-oxo-4H-chromen-8-yl)-4-hydroxyphenyl)-5,7-dihydroxy-4H-chromen-4-one Amentoflavone cid_5281600
TypeSmall organic molecule
Emp. Form.C30H18O10
Mol. Mass.538.4579
SMILESOc1ccc(cc1)-c1cc(=O)c2c(O)cc(O)c(-c3cc(ccc3O)-c3cc(O)c4c(cc(O)cc4=O)o3)c2o1