Reaction Details
TargetBone morphogenetic protein 1
LigandBDBM50130127
Substrate/Competitorn/a
Meas. Tech.ChEBML_158896
Ki 340±n/a nM
Citation Robinson, LAWilson, DMDelaet, NGBradley, EKDankwardt, SMCampbell, JAMartin, RLVan Wart, HEWalker, KASullivan, RW Novel inhibitors of procollagen C-proteinase. Part 2: glutamic acid hydroxamates. Bioorg Med Chem Lett13:2381-4 (2003) Bone morphogenetic protein 1
Name:Bone morphogenetic protein 1
Type:PROTEIN
Mol. Mass.:111254.03
Organism:Homo sapiens (Human)
Description:ChEMBL_518962
Residue:986
BDBM50130127
NameBDBM50130127
Synonyms:(R)-2-[Benzo[1,3]dioxol-5-ylmethyl-(4-methoxy-benzenesulfonyl)-amino]-5-(4-methanesulfonyl-piperazin-1-yl)-5-oxo-pentanoic acid hydroxyamide | CHEMBL80487
TypeSmall organic molecule
Emp. Form.C25H32N4O10S2
Mol. Mass.612.672
SMILESCOc1ccc(cc1)S(=O)(=O)N(Cc1ccc2OCOc2c1)[C@H](CCC(=O)N1CCN(CC1)S(C)(=O)=O)C(=O)NO