Reaction Details
TargetHigh affinity immunoglobulin epsilon receptor subunit alpha
LigandBDBM50130418
Substrate/Competitorn/a
Meas. Tech.ChEMBL_68795 (CHEMBL683434)
IC50 82000±n/a nM
Citation Buku, AMendlowitz, MCondie, BAPrice, JA Histamine-releasing activity and binding to the FcepsilonRI alpha human mast cell receptor subunit of mast cell degranulating peptide analogues with alanine substitutions. J Med Chem46:3008-12 (2003) 
 
High affinity immunoglobulin epsilon receptor subunit alpha
Name:High affinity immunoglobulin epsilon receptor subunit alpha
Type:PROTEIN
Mol. Mass.:29595.99
Organism:Homo sapiens (Human)
Description:ChEMBL_68795
Residue:257
BDBM50130418
NameBDBM50130418
Synonyms:CHEMBL267118 | IACNCKRHVIKPHICRKICGKN-NH2
TypeSmall organic molecule
Emp. Form.C107H189N39O24S4
Mol. Mass.2534.152
SMILESCC[C@H](C)[C@H](N)C(=O)N[C@@H](C)C(=O)N[C@@H](CS)C(=O)N[C@@H](CC(N)=O)C(=O)N[C@@H](CS)C(=O)N[C@@H](CCCCN)C(=O)N[C@@H](CCCNC(N)=N)C(=O)N[C@@H](Cc1cnc[nH]1)C(=O)N[C@@H](C(C)C)C(=O)N[C@@H]([C@@H](C)CC)C(=O)N[C@@H](CCCCN)C(=O)N1CCC[C@H]1C(=O)N[C@@H](Cc1cnc[nH]1)C(=O)N[C@@H]([C@@H](C)CC)C(=O)N[C@@H](CS)C(=O)N[C@@H](CCCNC(N)=N)C(=O)N[C@@H](CCCCN)C(=O)N[C@@H]([C@@H](C)CC)C(=O)N[C@@H](CS)C(=O)NCC(=O)N[C@@H](CCCCN)C(=O)N[C@@H](CC(N)=O)C(N)=O