Reaction Details
TargetThyroid hormone receptor beta
LigandBDBM50130594
Substrate/Competitorn/a
Meas. Tech.ChEMBL_210503 (CHEMBL811898)
Kd 0.22±n/a nM
Citation Yoshihara, HAApriletti, JWBaxter, JDScanlan, TS Structural determinants of selective thyromimetics. J Med Chem46:3152-61 (2003) 
 
Thyroid hormone receptor beta
Name:Thyroid hormone receptor beta
Type:Receptor
Mol. Mass.:52793.62
Organism:Homo sapiens (Human)
Description:Recombinant hThR was obtained from nuclear extracts from SF9 cells infected with baculovirus vectors encoding for ThRbeta 1.
Residue:461
BDBM50130594
NameBDBM50130594
Synonyms:3-[4-(4-Hydroxy-3-isopropyl-benzyl)-3,5-dimethyl-phenyl]-propionic acid | CHEMBL322361
TypeSmall organic molecule
Emp. Form.C21H26O3
Mol. Mass.326.4293
SMILESCC(C)c1cc(Cc2c(C)cc(CCC(O)=O)cc2C)ccc1O