Reaction Details
TargetThyroid hormone receptor alpha
LigandBDBM18860
Substrate/Competitorn/a
Meas. Tech.ChEMBL_210492 (CHEMBL814599)
Kd 0.06±n/a nM
Citation Yoshihara, HAApriletti, JWBaxter, JDScanlan, TS Structural determinants of selective thyromimetics. J Med Chem46:3152-61 (2003) 
 
Thyroid hormone receptor alpha
Name:Thyroid hormone receptor alpha
Type:Receptor
Mol. Mass.:54818.00
Organism:Homo sapiens (Human)
Description:Recombinant hThR was obtained from nuclear extracts from SF9 cells infected with baculovirus vectors encoding for ThRalpha 1.
Residue:490
BDBM18860
NameBDBM18860
Synonyms:(2R)-2-amino-3-[4-(4-hydroxy-3-iodophenoxy)-3,5-diiodophenyl]propanoic acid 3,5,3'-triiodo-L-thyronine (T3) Triiodothyronine US10544075, Compound T3 liothyronine | triothyrone
TypeHormone
Emp. Form.C15H12I3NO4
Mol. Mass.650.9735
SMILESN[C@@H](Cc1cc(I)c(Oc2ccc(O)c(I)c2)c(I)c1)C(O)=O