Reaction Details
TargetThyroid hormone receptor beta
LigandBDBM50130596
Substrate/Competitorn/a
Meas. Tech.ChEMBL_210504 (CHEMBL811899)
Kd 0.36±n/a nM
Citation Yoshihara, HAApriletti, JWBaxter, JDScanlan, TS Structural determinants of selective thyromimetics. J Med Chem46:3152-61 (2003) 
 
Thyroid hormone receptor beta
Name:Thyroid hormone receptor beta
Type:Receptor
Mol. Mass.:52793.62
Organism:Homo sapiens (Human)
Description:Recombinant hThR was obtained from nuclear extracts from SF9 cells infected with baculovirus vectors encoding for ThRbeta 1.
Residue:461
BDBM50130596
NameBDBM50130596
Synonyms:CHEMBL419016 | [4-(4-Hydroxy-3-isopropyl-phenoxy)-3,5-dimethyl-phenoxy]-acetic acid
TypeSmall organic molecule
Emp. Form.C19H22O5
Mol. Mass.330.375
SMILESCC(C)c1cc(Oc2c(C)cc(OCC(O)=O)cc2C)ccc1O