Reaction Details
TargetThyroid hormone receptor alpha
LigandBDBM50130596
Substrate/Competitorn/a
Meas. Tech.ChEMBL_210492 (CHEMBL814599)
Kd 2.4±n/a nM
Citation Yoshihara, HAApriletti, JWBaxter, JDScanlan, TS Structural determinants of selective thyromimetics. J Med Chem46:3152-61 (2003) 
 
Thyroid hormone receptor alpha
Name:Thyroid hormone receptor alpha
Type:Receptor
Mol. Mass.:54818.00
Organism:Homo sapiens (Human)
Description:Recombinant hThR was obtained from nuclear extracts from SF9 cells infected with baculovirus vectors encoding for ThRalpha 1.
Residue:490
BDBM50130596
NameBDBM50130596
Synonyms:CHEMBL419016 | [4-(4-Hydroxy-3-isopropyl-phenoxy)-3,5-dimethyl-phenoxy]-acetic acid
TypeSmall organic molecule
Emp. Form.C19H22O5
Mol. Mass.330.375
SMILESCC(C)c1cc(Oc2c(C)cc(OCC(O)=O)cc2C)ccc1O