Reaction Details
TargetCannabinoid receptor 1
LigandBDBM50130623
Substrate/Competitorn/a
Meas. Tech.ChEMBL_46808 (CHEMBL873202)
Ki 0.45±n/a nM
Citation Papahatjis, DPNikas, SPKourouli, TChari, RXu, WPertwee, RGMakriyannis, A Pharmacophoric requirements for the cannabinoid side chain. Probing the cannabinoid receptor subsite at C1'. J Med Chem46:3221-9 (2003) 
 
Cannabinoid receptor 1
Name:Cannabinoid receptor 1
Type:G Protein-Coupled Receptor (GPCR)
Mol. Mass.:52856.55
Organism:Rattus norvegicus (rat)
Description:P20272
Residue:473
BDBM50130623
NameBDBM50130623
Synonyms:(6aR,10aR)-3-(1-hexylcyclopentyl)-6,6,9-trimethyl-6a,7,10,10a-tetrahydro-6H-benzo[c]chromen-1-ol CHEMBL108868
TypeSmall organic molecule
Emp. Form.C27H40O2
Mol. Mass.396.6053
SMILESCCCCCCC1(CCCC1)c1cc(O)c2[C@@H]3CC(C)=CC[C@H]3C(C)(C)Oc2c1