Reaction Details
TargetCannabinoid receptor 1
LigandBDBM50067735
Substrate/Competitorn/a
Meas. Tech.ChEMBL_46808 (CHEMBL873202)
Ki 0.83±n/a nM
Citation Papahatjis, DPNikas, SPKourouli, TChari, RXu, WPertwee, RGMakriyannis, A Pharmacophoric requirements for the cannabinoid side chain. Probing the cannabinoid receptor subsite at C1'. J Med Chem46:3221-9 (2003) 
 
Cannabinoid receptor 1
Name:Cannabinoid receptor 1
Type:G Protein-Coupled Receptor (GPCR)
Mol. Mass.:52856.55
Organism:Rattus norvegicus (rat)
Description:P20272
Residue:473
BDBM50067735
NameBDBM50067735
Synonyms:(6aR,10aR)-3-(1,1-Dimethyl-heptyl)-6,6,9-trimethyl-6a,7,10,10a-tetrahydro-6H-benzo[c]chromen-1-ol 3-(1,1-Dimethyl-heptyl)-6,6,9-trimethyl-6a,7,10,10a-tetrahydro-6H-benzo[c]chromen-1-ol | CHEMBL411626
TypeSmall organic molecule
Emp. Form.C25H38O2
Mol. Mass.370.568
SMILESCCCCCCC(C)(C)c1cc(O)c2[C@@H]3CC(C)=CC[C@H]3C(C)(C)Oc2c1