Reaction Details
TargetCannabinoid receptor 2
LigandBDBM50130626
Substrate/Competitorn/a
Meas. Tech.ChEMBL_47002 (CHEMBL658971)
Ki 3.6±n/a nM
Citation Papahatjis, DPNikas, SPKourouli, TChari, RXu, WPertwee, RGMakriyannis, A Pharmacophoric requirements for the cannabinoid side chain. Probing the cannabinoid receptor subsite at C1'. J Med Chem46:3221-9 (2003) 
 
Cannabinoid receptor 2
Name:Cannabinoid receptor 2
Type:Enzyme Catalytic Domain
Mol. Mass.:38220.43
Organism:MOUSE
Description:P47936
Residue:347
BDBM50130626
NameBDBM50130626
Synonyms:(6aR,10aR)-3-(2-hexyl-1,3-dithian-2-yl)-6,6,9-trimethyl-6a,7,10,10a-tetrahydro-6H-benzo[c]chromen-1-ol CHEMBL108392
TypeSmall organic molecule
Emp. Form.C26H38O2S2
Mol. Mass.446.709
SMILESCCCCCCC1(SCCCS1)c1cc(O)c2[C@@H]3CC(C)=CC[C@H]3C(C)(C)Oc2c1