Reaction Details
TargetCytochrome P450 2C9
LigandBDBM50566257
Substrate/Competitorn/a
Meas. Tech.ChEMBL_2094626 (CHEMBL4775889)
EC50 26000±n/a nM
Citation Van der Plas, SEKelgtermans, HMammoliti, OMenet, CTricarico, GDe Blieck, AJoannesse, CDe Munck, TLambin, DCowart, MDropsit, SMartina, SLXGees, MWesse, ASConrath, KAndrews, M Discovery of GLPG2451, a Novel Once Daily Potentiator for the Treatment of Cystic Fibrosis. J Med Chem64:343-353 (2021) 
 
Cytochrome P450 2C9
Name:Cytochrome P450 2C9
Type:Enzyme
Mol. Mass.:55636.33
Organism:Homo sapiens (Human)
Description:P11712
Residue:490
BDBM50566257
NameBDBM50566257
Synonyms:CHEMBL4785210
TypeSmall organic molecule
Emp. Form.C16H16F3N3O5S
Mol. Mass.419.376
SMILESC[C@H](O)CNC(=O)c1ncc(cc1N)S(=O)(=O)c1ccc(OC(F)(F)F)cc1