Reaction Details
TargetCorticotropin-releasing factor receptor 1
LigandBDBM50130973
Substrate/Competitorn/a
Meas. Tech.ChEBML_51266
Ki 4±n/a nM
Citation Hodgetts, KJYoon, THuang, JGulianello, MKieltyka, APrimus, RBrodbeck, RDe Lombaert, SDoller, D 2-Aryl-3,6-dialkyl-5-dialkylaminopyrimidin-4-ones as novel crf-1 receptor antagonists. Bioorg Med Chem Lett13:2497-500 (2003) Corticotropin-releasing factor receptor 1
Name:Corticotropin-releasing factor receptor 1
Type:Enzyme
Mol. Mass.:50744.31
Organism:Homo sapiens (Human)
Description:P34998
Residue:444
BDBM50130973
NameBDBM50130973
Synonyms:5-Dipropylamino-3,6-diethyl-2-(2-methoxy-4,6-dimethyl-phenyl)-3H-pyrimidin-4-one | CHEMBL313479
TypeSmall organic molecule
Emp. Form.C23H35N3O2
Mol. Mass.385.5429
SMILESCCCN(CCC)c1c(CC)nc(-c2c(C)cc(C)cc2OC)n(CC)c1=O