Reaction Details
TargetTyrosine-protein phosphatase non-receptor type 1
LigandBDBM50131066
Substrate/Competitorn/a
Meas. Tech.ChEBML_162258
IC50>1000000±n/a nM
Citation Shim, YSKim, KCChi, DYLee, KHCho, H Formylchromone derivatives as a novel class of protein tyrosine phosphatase 1B inhibitors. Bioorg Med Chem Lett13:2561-3 (2003) Tyrosine-protein phosphatase non-receptor type 1
Name:Tyrosine-protein phosphatase non-receptor type 1
Type:Protein phosphatase
Mol. Mass.:49963.76
Organism:Homo sapiens (Human)
Description:Human recombinant GST-fusion PTP1B (1-435).
Residue:435
BDBM50131066
NameBDBM50131066
Synonyms:2-Oxo-2H-chromene-3-carboxylic acid | CHEMBL83294
TypeSmall organic molecule
Emp. Form.C10H6O4
Mol. Mass.190.1522
SMILESOC(=O)c1cc2ccccc2oc1=O