Reaction Details
TargetC-X-C chemokine receptor type 2
LigandBDBM50131180
Substrate/Competitorn/a
Meas. Tech.ChEBML_44674
IC50 10000±n/a nM
Citation Baxter, ABennion, CBent, JBoden, KBrough, SCooper, AKinchin, EKindon, NMcInally, TMortimore, MRoberts, BUnitt, J Hit-to-lead studies: the discovery of potent, orally bioavailable triazolethiol CXCR2 receptor antagonists. Bioorg Med Chem Lett13:2625-8 (2003) C-X-C chemokine receptor type 2
Name:C-X-C chemokine receptor type 2
Type:Protein
Mol. Mass.:40767.88
Organism:Homo sapiens (Human)
Description:P25025
Residue:360
BDBM50131180
NameBDBM50131180
Synonyms:5-(2,4-Dichloro-phenyl)-2-(4-methoxy-benzyl)-2H-[1,2,4]triazole-3-thiol | CHEMBL84752
TypeSmall organic molecule
Emp. Form.C16H13Cl2N3OS
Mol. Mass.366.265
SMILESCOc1ccc(Cn2nc([nH]c2=S)-c2ccc(Cl)cc2Cl)cc1