Reaction Details
TargetC-X-C chemokine receptor type 2
LigandBDBM50131183
Substrate/Competitorn/a
Meas. Tech.ChEBML_44674
IC50 3500±n/a nM
Citation Baxter, ABennion, CBent, JBoden, KBrough, SCooper, AKinchin, EKindon, NMcInally, TMortimore, MRoberts, BUnitt, J Hit-to-lead studies: the discovery of potent, orally bioavailable triazolethiol CXCR2 receptor antagonists. Bioorg Med Chem Lett13:2625-8 (2003) C-X-C chemokine receptor type 2
Name:C-X-C chemokine receptor type 2
Type:Protein
Mol. Mass.:40767.88
Organism:Homo sapiens (Human)
Description:P25025
Residue:360
BDBM50131183
NameBDBM50131183
Synonyms:2-Benzyl-5-(3-trifluoromethyl-phenyl)-2H-[1,2,4]triazole-3-thiol | CHEMBL84719
TypeSmall organic molecule
Emp. Form.C16H12F3N3S
Mol. Mass.335.347
SMILESFC(F)(F)c1cccc(c1)-c1nn(Cc2ccccc2)c(=S)[nH]1