Reaction Details
TargetC-X-C chemokine receptor type 2
LigandBDBM50131196
Substrate/Competitorn/a
Meas. Tech.ChEBML_44674
IC50 7700±n/a nM
Citation Baxter, ABennion, CBent, JBoden, KBrough, SCooper, AKinchin, EKindon, NMcInally, TMortimore, MRoberts, BUnitt, J Hit-to-lead studies: the discovery of potent, orally bioavailable triazolethiol CXCR2 receptor antagonists. Bioorg Med Chem Lett13:2625-8 (2003) C-X-C chemokine receptor type 2
Name:C-X-C chemokine receptor type 2
Type:Protein
Mol. Mass.:40767.88
Organism:Homo sapiens (Human)
Description:P25025
Residue:360
BDBM50131196
NameBDBM50131196
Synonyms:2-Benzyl-5-pyridin-4-yl-2H-[1,2,4]triazole-3-thiol | CHEMBL84988
TypeSmall organic molecule
Emp. Form.C14H12N4S
Mol. Mass.268.337
SMILESS=c1[nH]c(nn1Cc1ccccc1)-c1ccncc1