Reaction Details
TargetC-X-C chemokine receptor type 2
LigandBDBM50221043
Substrate/Competitorn/a
Meas. Tech.ChEMBL_44674 (CHEMBL656547)
IC50<4600±n/a nM
Citation Baxter, ABennion, CBent, JBoden, KBrough, SCooper, AKinchin, EKindon, NMcInally, TMortimore, MRoberts, BUnitt, J Hit-to-lead studies: the discovery of potent, orally bioavailable triazolethiol CXCR2 receptor antagonists. Bioorg Med Chem Lett13:2625-8 (2003) C-X-C chemokine receptor type 2
Name:C-X-C chemokine receptor type 2
Type:Protein
Mol. Mass.:40767.88
Organism:Homo sapiens (Human)
Description:P25025
Residue:360
BDBM50221043
NameBDBM50221043
Synonyms:CHEMBL315771
TypeSmall organic molecule
Emp. Form.C14H12N4S
Mol. Mass.268.337
SMILESSc1nc(nn1Cc1ccccc1)-c1cccnc1