Reaction Details
TargetAndrogen receptor
LigandBDBM50131271
Substrate/Competitorn/a
Meas. Tech.ChEBML_36132
Kd 1.4±n/a nM
Citation Ishioka, TTanatani, ANagasawa, KHashimoto, Y Anti-androgens with full antagonistic activity toward human prostate tumor LNCaP cells with mutated androgen receptor. Bioorg Med Chem Lett13:2655-8 (2003) Androgen receptor
Name:Androgen receptor
Type:Receptor
Mol. Mass.:99185.27
Organism:Homo sapiens (Human)
Description:CHO cells were stably transfected with human AR gene.
Residue:920
BDBM50131271
NameBDBM50131271
Synonyms:3-(4-Hydroxy-phenyl)-4-[1-(4-pyrrolidin-1-yl-phenyl)-meth-(Z)-ylidene]-4H-isoxazol-5-one | CHEMBL315964
TypeSmall organic molecule
Emp. Form.C20H18N2O3
Mol. Mass.334.3685
SMILESOc1ccc(cc1)C1=NOC(=O)\C1=C/c1ccc(cc1)N1CCCC1