Reaction Details
TargetAlpha-2C adrenergic receptor
LigandBDBM50131359
Substrate/Competitorn/a
Meas. Tech.ChEBML_33534
Ki 0.500000±n/a nM
Citation Andrés, JIAlcázar, JAlonso, JMAlvarez, RMCid, JMDe Lucas, AIFernández, JMartínez, SNieto, CPastor, JBakker, MHBiesmans, IHeylen, LIMegens, AA Synthesis of 3a,4-dihydro-3H-[1]benzopyrano[4,3-c]isoxazoles, displaying combined 5-HT uptake inhibiting and alpha(2)-adrenoceptor antagonistic activities: a novel series of potential antidepressants. Bioorg Med Chem Lett13:2719-25 (2003) Alpha-2C adrenergic receptor
Name:Alpha-2C adrenergic receptor
Type:Enzyme
Mol. Mass.:49552.32
Organism:Homo sapiens (Human)
Description:P18825
Residue:462
BDBM50131359
NameBDBM50131359
Synonyms:(3R,3aS)-7,8-Dimethoxy-3-[4-((E)-3-phenyl-allyl)-piperazin-1-ylmethyl]-3a,4-dihydro-3H-chromeno[4,3-c]isoxazole CHEMBL328114
TypeSmall organic molecule
Emp. Form.C26H31N3O4
Mol. Mass.449.542
SMILESCOc1cc2OC[C@H]3[C@H](CN4CCN(C\C=C\c5ccccc5)CC4)ON=C3c2cc1OC