Reaction Details
TargetAlpha-2C adrenergic receptor
LigandBDBM50131365
Substrate/Competitorn/a
Meas. Tech.ChEBML_33534
Ki 0.600000±n/a nM
Citation Andrés, JIAlcázar, JAlonso, JMAlvarez, RMCid, JMDe Lucas, AIFernández, JMartínez, SNieto, CPastor, JBakker, MHBiesmans, IHeylen, LIMegens, AA Synthesis of 3a,4-dihydro-3H-[1]benzopyrano[4,3-c]isoxazoles, displaying combined 5-HT uptake inhibiting and alpha(2)-adrenoceptor antagonistic activities: a novel series of potential antidepressants. Bioorg Med Chem Lett13:2719-25 (2003) Alpha-2C adrenergic receptor
Name:Alpha-2C adrenergic receptor
Type:Enzyme
Mol. Mass.:49552.32
Organism:Homo sapiens (Human)
Description:P18825
Residue:462
BDBM50131365
NameBDBM50131365
Synonyms:7,8-Dimethoxy-3-[4-((E)-3-phenyl-but-2-enyl)-piperazin-1-ylmethyl]-3a,4-dihydro-3H-chromeno[4,3-c]isoxazole | CHEMBL327875
TypeSmall organic molecule
Emp. Form.C27H33N3O4
Mol. Mass.463.5686
SMILESCOc1cc2OCC3C(CN4CCN(C\C=C(/C)c5ccccc5)CC4)ON=C3c2cc1OC