Reaction Details
TargetMatrix metalloproteinase-9
LigandBDBM50131385
Substrate/Competitorn/a
Meas. Tech.ChEBML_105394
Ki 0.060000±n/a nM
Citation Moriyama, HTsukida, TInoue, YKondo, HYoshino, KNishimura, S Structure--activity relationships of azasugar-based MMP/ADAM inhibitors. Bioorg Med Chem Lett13:2737-40 (2003) Matrix metalloproteinase-9
Name:Matrix metalloproteinase-9
Type:Enzyme
Mol. Mass.:78452.28
Organism:Homo sapiens (Human)
Description:P14780
Residue:707
BDBM50131385
NameBDBM50131385
Synonyms:(2R,3R,4R,5S)-3,4,5-Trihydroxy-1-(4-phenoxy-benzenesulfonyl)-piperidine-2-carboxylic acid hydroxyamide CHEMBL61193
TypeSmall organic molecule
Emp. Form.C18H20N2O8S
Mol. Mass.424.425
SMILESONC(=O)[C@H]1[C@@H](O)[C@H](O)[C@@H](O)CN1S(=O)(=O)c1ccc(Oc2ccccc2)cc1