Reaction Details
TargetStromelysin-1
LigandBDBM50131382
Substrate/Competitorn/a
Meas. Tech.ChEBML_104872
Ki 1.8±n/a nM
Citation Moriyama, HTsukida, TInoue, YKondo, HYoshino, KNishimura, S Structure--activity relationships of azasugar-based MMP/ADAM inhibitors. Bioorg Med Chem Lett13:2737-40 (2003) Stromelysin-1
Name:Stromelysin-1
Type:Enzyme
Mol. Mass.:53973.13
Organism:Homo sapiens (Human)
Description: P08254
Residue:477
BDBM50131382
NameBDBM50131382
Synonyms:(2R,3R,4R,5S)-1-(4-Cyclohexyloxy-benzenesulfonyl)-3,4,5-trihydroxy-piperidine-2-carboxylic acid hydroxyamide | CHEMBL327578
TypeSmall organic molecule
Emp. Form.C18H26N2O8S
Mol. Mass.430.473
SMILESONC(=O)[C@H]1[C@@H](O)[C@H](O)[C@@H](O)CN1S(=O)(=O)c1ccc(OC2CCCCC2)cc1